Target
Platelet-derived growth factor receptor beta
Ligand
BDBM236912
Substrate
Meas. Tech.
PDGFRβ Cellular Assay
Temperature
310.15±n/a K
IC50
192±n/a nM
Comments
extracted
Citation
 Hull, III, CEMalone, TC Substituted 1,2,3,4-tetrahydropyrido[3,4-E] pyrrolo[1,2-A]pyrimidines as kinase US Patent  US9388181 Publication Date 7/12/2016 
Target
Name:
Platelet-derived growth factor receptor beta
Synonyms:
Beta-type platelet-derived growth factor receptor CD140b antigen PDGF Receptor Substrate PDGFR PDGFR-1 PDGFRB PGFRB_HUMAN Platelet-derived growth factor receptor 1 Platelet-derived growth factor receptor beta (PDGFR-beta) Platelet-derived growth factor receptor beta (PDGFRbeta) | VHL/PDGFRB
Type:
Enzyme
Mol. Mass.:
123922.25
Organism:
Homo sapiens (Human)
Description:
P09619
Residue:
1106
  
Inhibitor
Name:
BDBM236912
Synonyms:
US9388181, 4
Type:
Small organic molecule
Emp. Form.:
C23H18F3N5O
Mol. Mass.:
437.4171
SMILES:
FC(F)(F)c1cccc(NC(=O)c2cccc(c2)N2CCc3c(C2)cnc2ccnn32)c1
: