Target
P2X purinoceptor 7
Ligand
BDBM237031
Substrate
Meas. Tech.
YO-PRO Assay
Temperature
310.15±n/a K
IC50
44±n/a nM
Comments
extracted
Citation
 Hilpert, KHubler, FRenneberg, DStamm, S Heterocyclic amide derivatives as P2X7 receptor antagonists US Patent  US9388197 Publication Date 7/12/2016 
Target
Name:
P2X purinoceptor 7
Synonyms:
ATP receptor P2RX7_HUMAN P2X purinoceptor 7 (P2X7) P2Z receptor | Purinergic receptor
Type:
Protein
Mol. Mass.:
68602.85
Organism:
Homo sapiens (Human)
Description:
Q99572
Residue:
595
  
Inhibitor
Name:
BDBM237031
Synonyms:
US9388197, 33
Type:
Small organic molecule
Emp. Form.:
C14H12Cl2N2O2S
Mol. Mass.:
343.228
SMILES:
Clc1cccc(CNC(=O)C2CCOc3ncsc23)c1Cl
: