Target
P2X purinoceptor 7
Ligand
BDBM237061
Substrate
Meas. Tech.
YO-PRO Assay
Temperature
310.15±n/a K
IC50
20±n/a nM
Comments
extracted
Citation
 Hilpert, KHubler, FRenneberg, DStamm, S Heterocyclic amide derivatives as P2X7 receptor antagonists US Patent  US9388197 Publication Date 7/12/2016 
Target
Name:
P2X purinoceptor 7
Synonyms:
ATP receptor P2RX7_HUMAN P2X purinoceptor 7 (P2X7) P2Z receptor | Purinergic receptor
Type:
Protein
Mol. Mass.:
68602.85
Organism:
Homo sapiens (Human)
Description:
Q99572
Residue:
595
  
Inhibitor
Name:
BDBM237061
Synonyms:
US9388197, 63
Type:
Small organic molecule
Emp. Form.:
C16H16Cl2N2OS
Mol. Mass.:
355.282
SMILES:
Clc1ccc(CCNC(=O)C2CCCc3ncsc23)c(Cl)c1
: