Target
Coagulation factor XI
Ligand
BDBM161055
Substrate
Meas. Tech.
In Vitro Assay
pH
7.4±n/a
Ki
<5.00±n/a nM
Comments
extracted
Citation
 Orwat, MJPinto, DJSmith, II, LMCorte, JRSrivastava, S Substituted 1,2,3,4-tetrahydro-2,6-naphthyridines as factor XIa inhibitors US Patent  US9394276 Publication Date 7/19/2016 
Target
Name:
Coagulation factor XI
Synonyms:
Coagulation factor XIa Coagulation factor XIa light chain FA11_HUMAN Factor XIa PTA | Plasma thromboplastin antecedent
Type:
Enzyme
Mol. Mass.:
70130.58
Organism:
Homo sapiens (Human)
Description:
P03951
Residue:
625
  
Inhibitor
Name:
BDBM161055
Synonyms:
US9108951, 10 US9725435, 10
Type:
Small organic molecule
Emp. Form.:
C27H20ClFN6O4
Mol. Mass.:
546.937
SMILES:
OC(=O)c1ccc(NC(=O)[C@H]2N(CCc3ccccc23)C(=O)\C=C\c2c(F)c(Cl)ccc2-n2cnnn2)cc1
: