Target
Coagulation factor XI
Ligand
BDBM161057
Substrate
Meas. Tech.
In Vitro Assay
pH
7.4±n/a
Ki
<5.00±n/a nM
Comments
extracted
Citation
 Orwat, MJPinto, DJSmith, II, LMCorte, JRSrivastava, S Substituted 1,2,3,4-tetrahydro-2,6-naphthyridines as factor XIa inhibitors US Patent  US9394276 Publication Date 7/19/2016 
Target
Name:
Coagulation factor XI
Synonyms:
Coagulation factor XIa Coagulation factor XIa light chain FA11_HUMAN Factor XIa PTA | Plasma thromboplastin antecedent
Type:
Enzyme
Mol. Mass.:
70130.58
Organism:
Homo sapiens (Human)
Description:
P03951
Residue:
625
  
Inhibitor
Name:
BDBM161057
Synonyms:
US9108951, 23 US9725435, 23
Type:
Small organic molecule
Emp. Form.:
C33H24ClFN10O3
Mol. Mass.:
663.06
SMILES:
NC(=O)c1ccc(cc1)-c1nccc2C(N(CCc12)C(=O)\C=C\c1c(F)c(Cl)ccc1-n1cnnn1)C(=O)Nc1ccc2cn[nH]c2c1
: