Target
Coagulation factor XI
Ligand
BDBM161058
Substrate
Meas. Tech.
In Vitro Assay
pH
7.4±n/a
Ki
<5.00±n/a nM
Comments
extracted
Citation
 Orwat, MJPinto, DJSmith, II, LMCorte, JRSrivastava, S Substituted 1,2,3,4-tetrahydro-2,6-naphthyridines as factor XIa inhibitors US Patent  US9394276 Publication Date 7/19/2016 
Target
Name:
Coagulation factor XI
Synonyms:
Coagulation factor XIa Coagulation factor XIa light chain FA11_HUMAN Factor XIa PTA | Plasma thromboplastin antecedent
Type:
Enzyme
Mol. Mass.:
70130.58
Organism:
Homo sapiens (Human)
Description:
P03951
Residue:
625
  
Inhibitor
Name:
BDBM161058
Synonyms:
US9108951, 28 US9725435, 28
Type:
Small organic molecule
Emp. Form.:
C30H26ClFN8O5
Mol. Mass.:
633.029
SMILES:
OC(=O)c1ccc(NC(=O)C2N(CCc3c2ccnc3N2CCOCC2)C(=O)\C=C\c2c(F)c(Cl)ccc2-n2cnnn2)cc1
: