Target
Coagulation factor XI
Ligand
BDBM161088
Substrate
Meas. Tech.
In Vitro Assay
pH
7.4±n/a
Ki
258.00±n/a nM
Comments
extracted
Citation
 Orwat, MJPinto, DJSmith, II, LMCorte, JRSrivastava, S Substituted 1,2,3,4-tetrahydro-2,6-naphthyridines as factor XIa inhibitors US Patent  US9394276 Publication Date 7/19/2016 
Target
Name:
Coagulation factor XI
Synonyms:
Coagulation factor XIa Coagulation factor XIa light chain FA11_HUMAN Factor XIa PTA | Plasma thromboplastin antecedent
Type:
Enzyme
Mol. Mass.:
70130.58
Organism:
Homo sapiens (Human)
Description:
P03951
Residue:
625
  
Inhibitor
Name:
BDBM161088
Synonyms:
US9108951, 100 US9725435, 100
Type:
Small organic molecule
Emp. Form.:
C33H25Cl2N9O5
Mol. Mass.:
698.515
SMILES:
OC(=O)c1ccc(NC(=O)C2N(CCc3ncc(NC(=O)Nc4ccc(Cl)cc4)cc23)C(=O)\C=C\c2cc(Cl)ccc2-n2cnnn2)cc1
: