Target
Cytochrome P450 2C9
Ligand
BDBM237160
Substrate
Meas. Tech.
Inhibition Assay
Temperature
310.15±n/a K
IC50
1.5e+4±n/a nM
Comments
extracted
Citation
 Krasinski, APunna, SUngashe, SWang, QZeng, Y Fused heteroaryl pyridyl and phenyl benzenesuflonamides as CCR2 modulators for the treatment of inflammation US Patent  US9394307 Publication Date 7/19/2016 
Target
Name:
Cytochrome P450 2C9
Synonyms:
(R)-limonene 6-monooxygenase CP2C9_HUMAN CYP2C9 Cytochrome P450 2C9 (CYP2C9 ) P-450MP P450 PB-1 | S-mephenytoin 4-hydroxylase
Type:
Enzyme
Mol. Mass.:
55636.33
Organism:
Homo sapiens (Human)
Description:
P11712
Residue:
490
  
Inhibitor
Name:
BDBM237160
Synonyms:
US9394307, 4-chloro-N-(5-chloro-2-{7H-pyrrolo[2,3-d]pyrimidine-4-carbonyl}pyridin-3-yl)-3-(trifluoromethyl)benzene-1-sulfonamide
Type:
Small organic molecule
Emp. Form.:
C19H10Cl2F3N5O3S
Mol. Mass.:
516.281
SMILES:
FC(F)(F)c1cc(ccc1Cl)S(=O)(=O)Nc1cc(Cl)cnc1C(=O)c1ncnc2[nH]ccc12
: