Target
Stromelysin-1
Ligand
BDBM237180
Substrate
Meas. Tech.
MMP-3 Activity Assay
pH
7.4±0
Temperature
310.15±0 K
IC50
4.75e+3±n/a nM
Citation
 Qiu, ZYan, MLi, QLiu, DVan den Steen, PEWang, MOpdenakker, GHu, J Definition of peptide inhibitors from a synthetic peptide library by targeting gelatinase B/matrix metalloproteinase-9 (MMP-9) and TNF-a converting enzyme (TACE/ADAM-17). J Enzyme Inhib Med Chem 27:533-40 (2012)  
Target
Name:
Stromelysin-1
Synonyms:
MMP-3 MMP3_HUMAN Matrix metalloproteinase 3 Matrix metalloproteinase-3 (MMP-3) SL-1 Stromelysin 1 | Transin-1
Type:
Enzyme
Mol. Mass.:
53973.13
Organism:
Homo sapiens (Human)
Description:
P08254
Residue:
477
  
Inhibitor
Name:
BDBM237180
Synonyms:
(D-Pyr)-(D-Cys)-Bip-Arg
Type:
Small organic molecule
Emp. Form.:
C35H45N9O6S
Mol. Mass.:
719.853
SMILES:
C[C@@H](Nc1ccccn1)C(=O)N[C@H](CS)C(=O)N[C@@H](Cc1ccccc1)C(=O)N[C@@H](Cc1ccccc1)C(=O)N[C@@H](CCCNC(N)=N)C(O)=O
: