Target
Prothrombin
Ligand
BDBM237208
Substrate
Meas. Tech.
Enzyme Assay
pH
8±n/a
IC50
400000±n/a nM
Comments
extracted
Citation
 Viskupicova, JDanihelova, MMajekova, MLiptaj, TSturdik, E Polyphenol fatty acid esters as serine protease inhibitors: a quantum-chemical QSAR analysis. J Enzyme Inhib Med Chem 27:800-9 (2012)  
Target
Name:
Prothrombin
Synonyms:
Activation peptide fragment 1 Coagulation factor II Prothrombin Thrombin Thrombin light chain
Type:
Enzyme
Mol. Mass.:
70502.73
Organism:
Bos taurus (Bovine)
Description:
P00735
Residue:
625
  
Inhibitor
Name:
BDBM237208
Synonyms:
4-Guanidinobenzoate
Type:
Small organic molecule
Emp. Form.:
C8H9N3O2
Mol. Mass.:
179.176
SMILES:
[#7]\[#6](-[#7])=[#7]\c1ccc(cc1)-[#6](-[#8])=O
: