Target
Acetylcholinesterase
Ligand
BDBM293405
Substrate
Meas. Tech.
Measurement of IC50 of Eckol Derivatives Against Acetylcholinesterase and Butyrylcholinesterase
pH
7.4±n/a
Temperature
298.15±n/a K
IC50
23200±n/a nM
Comments
extracted
Citation
 Shin, HHwang, HPark, KYKim, SHLee, H Eckol derivatives, methods of synthesis and uses thereof US Patent  US10106521 Publication Date 10/23/2018 
Target
Name:
Acetylcholinesterase
Synonyms:
ACES_HUMAN Acetylcholinesterase (AChE) | Acetylcholinesterase (human AChE)
Type:
Enzyme
Mol. Mass.:
67792.70
Organism:
Homo sapiens (Human)
Description:
P22303
Residue:
614
  
Inhibitor
Name:
BDBM293405
Synonyms:
US10106521, Compound 14-O-Benzyl Phlorofucofuroeckol A
Type:
Small organic molecule
Emp. Form.:
C37H24O14
Mol. Mass.:
692.5781
SMILES:
Oc1cc(O)cc(Oc2c(O)cc(O)c3Oc4c(Oc23)c(OCc2ccccc2)cc2oc3c(Oc5cc(O)cc(O)c5)c(O)cc(O)c3c42)c1
: