Target
Carbonic anhydrase 6
Ligand
BDBM39340
Substrate
Meas. Tech.
CA Activity Assay
pH
7.4±n/a
Ki
11670±n/a nM
Comments
extracted
Citation
 Ekinci, DKurbanoglu, NISalamci, ESentürk, MSupuran, CT Carbonic anhydrase inhibitors: inhibition of human and bovine isoenzymes by benzenesulphonamides, cyclitols and phenolic compounds. J Enzyme Inhib Med Chem 27:845-8 (2012)  
Target
Name:
Carbonic anhydrase 6
Synonyms:
CA-VI CAH6_HUMAN Carbonic Anhydrase VI Carbonic anhydrase 6 Carbonic anhydrase 6 (CA-VI) Salivary carbonic anhydrase | Secreted carbonic anhydrase
Type:
Enzyme
Mol. Mass.:
35371.40
Organism:
Homo sapiens (Human)
Description:
P23280
Residue:
308
  
Inhibitor
Name:
BDBM39340
Synonyms:
4-Amino-N-(pyrimidin-2-yl) benzenesulfonamide (Sulfadiazine) (14) SMR000058213 cid_5336
Type:
Small organic molecule
Emp. Form.:
C11H11N3O2S
Mol. Mass.:
249.289
SMILES:
Nc1ccc(cc1)S(=O)(=O)Nc1ccccn1
: