Target
Carbonic anhydrase 1
Ligand
BDBM237298
Substrate
4-Nitrophenyl acetate (NPA)
Meas. Tech.
Esterase Activity Assay
Ki
7.913e+4±n/a nM
Citation
 Kazancioglu, EAGüney, MSentürk, MSupuran, CT Simple methanesulfonates are hydrolyzed by the sulfatase carbonic anhydrase activity. J Enzyme Inhib Med Chem 27:880-5 (2012)  
Target
Name:
Carbonic anhydrase 1
Synonyms:
CA-I CAB Carbonate dehydratase I Carbonic anhydrase 1 (CA I) Carbonic anhydrase 1 (Recombinant CA I) Carbonic anhydrase B Carbonic anhydrase I (CA I) Carbonic anhydrase I (CAI) Carbonic anhydrase isoenzyme I (hCA I) | hCA
Type:
Enzyme
Mol. Mass.:
28873.37
Organism:
Homo sapiens (Human)
Description:
P00915
Residue:
261
  
Inhibitor
Name:
BDBM237298
Synonyms:
4-Formyl-2-methoxyphenyl methanesulfonate (15)
Type:
Small organic molecule
Emp. Form.:
C9H10O5S
Mol. Mass.:
230.238
SMILES:
COc1cc(C=O)ccc1OS(C)(=O)=O
:
Substrate
Name:
BDBM11326
Synonyms:
4-nitrophenyl acetate | p-Nitrophenyl Acetate
Type:
Small organic molecule
Emp. Form.:
C8H7NO4
Mol. Mass.:
181.1455
SMILES:
CC(=O)Oc1ccc(cc1)[N+]([O-])=O
: