Target
Carbonic anhydrase 4
Ligand
BDBM237293
Substrate
4-Nitrophenyl acetate (NPA)
Meas. Tech.
Esterase Activity Assay
Ki
2.648e+4±n/a nM
Citation
 Kazancioglu, EAGüney, MSentürk, MSupuran, CT Simple methanesulfonates are hydrolyzed by the sulfatase carbonic anhydrase activity. J Enzyme Inhib Med Chem 27:880-5 (2012)  
Target
Name:
Carbonic anhydrase 4
Synonyms:
CA-IV CAH4_HUMAN Carbonic anhydrase Carbonic anhydrase IV (CA IV)
Type:
Enzyme
Mol. Mass.:
35037.98
Organism:
Homo sapiens (Human)
Description:
P22748
Residue:
312
  
Inhibitor
Name:
BDBM237293
Synonyms:
Biphenyl-4-ylmethanesulfonate (5)
Type:
Small organic molecule
Emp. Form.:
C13H12O3S
Mol. Mass.:
248.298
SMILES:
CS(=O)(=O)Oc1ccc(cc1)-c1ccccc1
:
Substrate
Name:
BDBM11326
Synonyms:
4-nitrophenyl acetate | p-Nitrophenyl Acetate
Type:
Small organic molecule
Emp. Form.:
C8H7NO4
Mol. Mass.:
181.1455
SMILES:
CC(=O)Oc1ccc(cc1)[N+]([O-])=O
: