Target
Protein farnesyltransferase subunit beta/geranylgeranyltransferase type-1 subunit alpha
Ligand
BDBM238366
Substrate
Meas. Tech.
Yeast FTase Assay
pH
7.5±n/a
IC50
610±40 nM
Comments
extracted
Citation
 Lethu, SBosc, DMouray, EGrellier, PDubois, J New protein farnesyltransferase inhibitors in the 3-arylthiophene 2-carboxylic acid series: diversification of the aryl moiety by solid-phase synthesis. J Enzyme Inhib Med Chem 28:163-71 (2013)  
Target
Name:
Protein farnesyltransferase subunit beta/geranylgeranyltransferase type-1 subunit alpha
Synonyms:
Farnesyltransferase Protein farnesyltransferase beta/geranylgeranyltransferase type I alpha subunit
Type:
Mol. Mass.:
Description:
ASSAY_ID of EBI is 70753
Components:
This complex has 2 components.
Component 1
Name:
Protein farnesyltransferase subunit beta
Synonyms:
CAAX farnesyltransferase subunit beta FNTB_YEAST Farnesyltransferase Ras proteins prenyltransferase subunit beta STE16
Type:
Protein
Mol. Mass.:
48188.41
Organism:
Saccharomyces cerevisiae (Baker's yeast)
Description:
P22007
Residue:
431
  
Component 2
Name:
Protein farnesyltransferase/geranylgeranyltransferase type-1 subunit alpha
Synonyms:
CAAX farnesyltransferase subunit alpha FTase-alpha GGTase-I-alpha Protein farnesyltransferase/geranylgeranyltransferase type-1 subunit alpha Ras proteins prenyltransferase subunit alpha | Type I protein geranyl-geranyltransferase subunit alpha
Type:
PROTEIN
Mol. Mass.:
37495.69
Organism:
Saccharomyces cerevisiae
Description:
ChEMBL_588425
Residue:
316
  
Inhibitor
Name:
BDBM238366
Synonyms:
3-Phenyl-4-cyano-5-(isopropylthio)thiophene-2-carboxylic acid (1s)
Type:
Small organic molecule
Emp. Form.:
C15H13NO2S2
Mol. Mass.:
303.399
SMILES:
CC(C)Sc1sc(C(O)=O)c(c1C#N)-c1ccccc1
: