Target
Protein farnesyltransferase alpha subunit/subunit beta
Ligand
BDBM50067584
Substrate
Meas. Tech.
T. brucei FTase Assay
IC50
10.0±2.0 nM
Citation
 Lethu, SBosc, DMouray, EGrellier, PDubois, J New protein farnesyltransferase inhibitors in the 3-arylthiophene 2-carboxylic acid series: diversification of the aryl moiety by solid-phase synthesis. J Enzyme Inhib Med Chem 28:163-71 (2013)  
Target
Name:
Protein farnesyltransferase alpha subunit/subunit beta
Synonyms:
Farnesyltransferase (FTase)
Type:
Enzyme
Mol. Mass.:
Description:
T. brucei FTase
Components:
This complex has 2 components.
Component 1
Name:
Protein farnesyltransferase alpha subunit
Synonyms:
Protein farnesyltransferase subunit alpha
Type:
Protein
Mol. Mass.:
70116.60
Organism:
Trypanosoma brucei brucei
Description:
Q9NC77
Residue:
612
  
Component 2
Name:
Protein farnesyltransferase subunit beta
Synonyms:
Type:
Protein
Mol. Mass.:
65426.56
Organism:
Trypanosoma brucei brucei
Description:
Q9NC76
Residue:
585
  
Inhibitor
Name:
BDBM50067584
Synonyms:
(S)-2-{[5-((R)-2-Amino-3-mercapto-propylamino)-biphenyl-2-carbonyl]-amino}-4-methylsulfanyl-butyric acid 2-{[5-(2-Amino-3-mercapto-propylamino)-biphenyl-2-carbonyl]-amino}-4-methylsulfanyl-butyric acid FTI-276
Type:
Small organic molecule
Emp. Form.:
C21H27N3O3S2
Mol. Mass.:
433.587
SMILES:
CSCC[C@H](NC(=O)c1ccc(NC[C@@H](N)CS)cc1-c1ccccc1)C(O)=O
: