Target
Gag-Pol polyprotein
Ligand
BDBM237343
Substrate
Meas. Tech.
HIV-1 RT Activity Assay
pH
7.8±0
Temperature
310.15±0 K
IC50
>4.0e+4±n/a nM
Citation
 Pitta, EGeronikaki, ASurmava, SEleftheriou, PMehta, VPVan der Eycken, EV Synthesis and HIV-1 RT inhibitory action of novel (4/6-substituted benzo[d]thiazol -2-yl)thiazolidin-4-ones. Divergence from the non-competitive inhibition mechanism. J Enzyme Inhib Med Chem 28:113-22 (2013)  
Target
Name:
Gag-Pol polyprotein
Synonyms:
HIV-1 reverse transcriptase (HIV-1 RT) POL_HV1H2 Protease Reverse transcriptase (RT) gag-pol p66 RT
Type:
Protein
Mol. Mass.:
162074.74
Organism:
Human immunodeficiency virus type 1 group M subtype B (isolate HXB2)
Description:
P04585
Residue:
1435
  
Inhibitor
Name:
BDBM237343
Synonyms:
3-(6-Chlorobenzo[d]thiazol-2-yl)-2-(2,6-dichlorophenyl)thiazolidin-4-one (3)
Type:
Small organic molecule
Emp. Form.:
C16H9Cl3N2OS2
Mol. Mass.:
415.744
SMILES:
Clc1ccc2nc(sc2c1)N1C(SCC1=O)c1c(Cl)cccc1Cl
: