Target
Platelet-derived growth factor receptor beta
Ligand
BDBM238345
Substrate
Meas. Tech.
Inhibition Assay
IC50
66±n/a nM
Citation
 Bae, IHHan, SMKwak, EJAhn, YGSuh, KH Isoquinoline-5-carboxamide derivative having inhibitory activity for protein kinase US Patent  US9388165 Publication Date 7/12/2016 
Target
Name:
Platelet-derived growth factor receptor beta
Synonyms:
Beta-type platelet-derived growth factor receptor CD140b antigen PDGF Receptor Substrate PDGFR PDGFR-1 PDGFRB PGFRB_HUMAN Platelet-derived growth factor receptor 1 Platelet-derived growth factor receptor beta (PDGFR-beta) Platelet-derived growth factor receptor beta (PDGFRbeta) | VHL/PDGFRB
Type:
Enzyme
Mol. Mass.:
123922.25
Organism:
Homo sapiens (Human)
Description:
P09619
Residue:
1106
  
Inhibitor
Name:
BDBM238345
Synonyms:
US9388165, 1
Type:
Small organic molecule
Emp. Form.:
C25H19F3N4O2
Mol. Mass.:
464.4392
SMILES:
Cc1ccc(NC(=O)c2cccc(c2)C(F)(F)F)cc1NC(=O)c1cccc2c(N)nccc12
: