Target
Bromodomain-containing protein 4 [1-477]
Ligand
BDBM237409
Substrate
Meas. Tech.
Time-Resolved Fluorescence Resonance Energy Transfer (TR-FRET) Assay
pH
7.5±n/a
IC50
270±n/a nM
Comments
extracted
Citation
 Ren, BZhou, CWang, H Substituted 5-(3,5-dimethylisoxazol-4-yl)indoline-2-ones US Patent  US9393232 Publication Date 7/19/2016 
Target
Name:
Bromodomain-containing protein 4 [1-477]
Synonyms:
BRD4 Bromodomain-containing protein 4 (BRD4 (aa 1-477) HUNK1
Type:
Enzyme Catalytic Domain
Mol. Mass.:
53061.90
Organism:
Homo sapiens (Human)
Description:
aa (1-477)
Residue:
477
  
Inhibitor
Name:
BDBM237409
Synonyms:
US9393232, 1.17
Type:
Small organic molecule
Emp. Form.:
C18H20N2O3
Mol. Mass.:
312.363
SMILES:
Cc1noc(C)c1-c1ccc2NC(=O)C(O)(C3CCCC3)c2c1
: