Target
Bromodomain-containing protein 4 [1-477]
Ligand
BDBM237514
Substrate
Meas. Tech.
Time-Resolved Fluorescence Resonance Energy Transfer (TR-FRET) Assay
pH
7.5±n/a
IC50
710±n/a nM
Comments
extracted
Citation
 Ren, BZhou, CWang, H Substituted 5-(3,5-dimethylisoxazol-4-yl)indoline-2-ones US Patent  US9393232 Publication Date 7/19/2016 
Target
Name:
Bromodomain-containing protein 4 [1-477]
Synonyms:
BRD4 Bromodomain-containing protein 4 (BRD4 (aa 1-477) HUNK1
Type:
Enzyme Catalytic Domain
Mol. Mass.:
53061.90
Organism:
Homo sapiens (Human)
Description:
aa (1-477)
Residue:
477
  
Inhibitor
Name:
BDBM237514
Synonyms:
US9393232, 2.13a | US9393232, 2.13b
Type:
Small organic molecule
Emp. Form.:
C22H23N3O3
Mol. Mass.:
377.4363
SMILES:
C[C@@H](O)CNC1(C(=O)Nc2ccc(cc12)-c1c(C)noc1C)c1ccccc1
: