Target
Bromodomain-containing protein 4 [1-477]
Ligand
BDBM237516
Substrate
Meas. Tech.
Time-Resolved Fluorescence Resonance Energy Transfer (TR-FRET) Assay
pH
7.5±n/a
IC50
26±n/a nM
Comments
extracted
Citation
 Ren, BZhou, CWang, H Substituted 5-(3,5-dimethylisoxazol-4-yl)indoline-2-ones US Patent  US9393232 Publication Date 7/19/2016 
Target
Name:
Bromodomain-containing protein 4 [1-477]
Synonyms:
BRD4 Bromodomain-containing protein 4 (BRD4 (aa 1-477) HUNK1
Type:
Enzyme Catalytic Domain
Mol. Mass.:
53061.90
Organism:
Homo sapiens (Human)
Description:
aa (1-477)
Residue:
477
  
Inhibitor
Name:
BDBM237516
Synonyms:
US9393232, 2.17 US9393232, 2.17b
Type:
Small organic molecule
Emp. Form.:
C24H25N3O3
Mol. Mass.:
403.4736
SMILES:
Cc1noc(C)c1-c1ccc2NC(=O)C(N3CCC[C@@H](O)C3)(c2c1)c1ccccc1
: