Target
Bromodomain-containing protein 4 [1-477]
Ligand
BDBM237532
Substrate
Meas. Tech.
Time-Resolved Fluorescence Resonance Energy Transfer (TR-FRET) Assay
pH
7.5±n/a
IC50
670±n/a nM
Comments
extracted
Citation
 Ren, BZhou, CWang, H Substituted 5-(3,5-dimethylisoxazol-4-yl)indoline-2-ones US Patent  US9393232 Publication Date 7/19/2016 
Target
Name:
Bromodomain-containing protein 4 [1-477]
Synonyms:
BRD4 Bromodomain-containing protein 4 (BRD4 (aa 1-477) HUNK1
Type:
Enzyme Catalytic Domain
Mol. Mass.:
53061.90
Organism:
Homo sapiens (Human)
Description:
aa (1-477)
Residue:
477
  
Inhibitor
Name:
BDBM237532
Synonyms:
US9393232, 4.2
Type:
Small organic molecule
Emp. Form.:
C16H16N2O4
Mol. Mass.:
300.3092
SMILES:
CC(=O)CC1(O)C(=O)Nc2ccc(cc12)-c1c(C)noc1C
: