Target
Dual specificity tyrosine-phosphorylation-regulated kinase 1A
Ligand
BDBM293442
Substrate
Meas. Tech.
The DYRK1A kinase assa
Temperature
298.15±n/a K
EC50
1.10±n/a nM
Comments
extracted
Citation
 KC, SKMak, CCEastman, BWCao, JBollu, VMittapalli, GKChiruta, C Isoquinolin-3-yl carboxamides and preparation and use thereof US Patent  US10106527 Publication Date 10/23/2018 
Target
Name:
Dual specificity tyrosine-phosphorylation-regulated kinase 1A
Synonyms:
DYR1A_HUMAN DYRK1A Dual specificity YAK1-related kinase 1A (Dyrk1A) Dual-specificity tyrosine-phosphorylation regulated kinase 1A HP86 MNBH
Type:
Enzyme
Mol. Mass.:
85616.61
Organism:
Homo sapiens (Human)
Description:
Q13627
Residue:
763
  
Inhibitor
Name:
BDBM293442
Synonyms:
US10106527, Compound 28 US10604514, Compound 81 US20230286945, Compound 28 | US9951048, Compound 28
Type:
Small organic molecule
Emp. Form.:
C20H15FN4O
Mol. Mass.:
346.3577
SMILES:
Cn1cncc1-c1ccc2cnc(NC(=O)c3ccc(F)cc3)cc2c1
: