Target
Dual specificity tyrosine-phosphorylation-regulated kinase 1A
Ligand
BDBM293557
Substrate
Meas. Tech.
The DYRK1A kinase assa
Temperature
298.15±n/a K
EC50
18.9±n/a nM
Comments
extracted
Citation
 KC, SKMak, CCEastman, BWCao, JBollu, VMittapalli, GKChiruta, C Isoquinolin-3-yl carboxamides and preparation and use thereof US Patent  US10106527 Publication Date 10/23/2018 
Target
Name:
Dual specificity tyrosine-phosphorylation-regulated kinase 1A
Synonyms:
DYR1A_HUMAN DYRK1A Dual specificity YAK1-related kinase 1A (Dyrk1A) Dual-specificity tyrosine-phosphorylation regulated kinase 1A HP86 MNBH
Type:
Enzyme
Mol. Mass.:
85616.61
Organism:
Homo sapiens (Human)
Description:
Q13627
Residue:
763
  
Inhibitor
Name:
BDBM293557
Synonyms:
US10106527, Compound 258 US11548872, Compound 258 US9951048, Compound 258
Type:
Small organic molecule
Emp. Form.:
C22H22N8O
Mol. Mass.:
414.4631
SMILES:
CN1CCN(CC1)c1cc(ccn1)C(=O)Nc1cc2cc(ccc2cn1)-n1cncn1
: