Target
Glycogen synthase kinase-3 beta
Ligand
BDBM293589
Substrate
Meas. Tech.
GSK3 beta kinase assay
Temperature
298.15±n/a K
EC50
>10000±n/a nM
Comments
extracted
Citation
 KC, SKMak, CCEastman, BWCao, JBollu, VMittapalli, GKChiruta, C Isoquinolin-3-yl carboxamides and preparation and use thereof US Patent  US10106527 Publication Date 10/23/2018 
Target
Name:
Glycogen synthase kinase-3 beta
Synonyms:
GSK-3 beta GSK3B Glycogen synthase kinase 3 beta (GSK3B) Glycogen synthase kinase-3 beta (GSK-3B) Glycogen synthase kinase-3 beta (GSK3B) Glycogen synthase kinase-3beta (GSK3B) | Serine/threonine-protein kinase GSK3B
Type:
Enzyme
Mol. Mass.:
46756.38
Organism:
Homo sapiens (Human)
Description:
P49841
Residue:
420
  
Inhibitor
Name:
BDBM293589
Synonyms:
US10106527, Compound 330 US11548872, Compound 330 US9951048, Compound 330
Type:
Small organic molecule
Emp. Form.:
C23H21ClN6OS
Mol. Mass.:
464.97
SMILES:
CN1CCN(CC1)c1cc(ccn1)C(=O)Nc1cc2cc(ccc2cn1)-c1ncc(Cl)s1
: