Target
Glycogen synthase kinase-3 beta
Ligand
BDBM293652
Substrate
Meas. Tech.
GSK3 beta kinase assay
Temperature
298.15±n/a K
EC50
10.00±n/a nM
Comments
extracted
Citation
 KC, SKMak, CCEastman, BWCao, JBollu, VMittapalli, GKChiruta, C Isoquinolin-3-yl carboxamides and preparation and use thereof US Patent  US10106527 Publication Date 10/23/2018 
Target
Name:
Glycogen synthase kinase-3 beta
Synonyms:
GSK-3 beta GSK3B Glycogen synthase kinase 3 beta (GSK3B) Glycogen synthase kinase-3 beta (GSK-3B) Glycogen synthase kinase-3 beta (GSK3B) Glycogen synthase kinase-3beta (GSK3B) | Serine/threonine-protein kinase GSK3B
Type:
Enzyme
Mol. Mass.:
46756.38
Organism:
Homo sapiens (Human)
Description:
P49841
Residue:
420
  
Inhibitor
Name:
BDBM293652
Synonyms:
US10106527, Compound 458 US11548872, Compound 458 US9951048, Compound 458
Type:
Small organic molecule
Emp. Form.:
C25H27N7O
Mol. Mass.:
441.5282
SMILES:
CN1CCN(CC1)c1cc(CC(=O)Nc2cc3cc(ccc3cn2)-c2cnn(C)c2)ccn1
: