Target
Coagulation factor XI
Ligand
BDBM238254
Substrate
Meas. Tech.
In Vitro Assay
IC50
78±n/a nM
Citation
 Imagawa, AKondo, TNishiyama, TCourtney, SYarnold, CIchihara, OFlanagan, S Substituted pyrrolidines as factor xia inhibitors for the treatment thromboembolic diseases US Patent  US9394250 Publication Date 7/19/2016 
Target
Name:
Coagulation factor XI
Synonyms:
Coagulation factor XIa Coagulation factor XIa light chain FA11_HUMAN Factor XIa PTA | Plasma thromboplastin antecedent
Type:
Enzyme
Mol. Mass.:
70130.58
Organism:
Homo sapiens (Human)
Description:
P03951
Residue:
625
  
Inhibitor
Name:
BDBM238254
Synonyms:
US10882855, Example 39 US9585881, Example 39
Type:
Small organic molecule
Emp. Form.:
C31H31ClN8O4S
Mol. Mass.:
647.147
SMILES:
Clc1ccc(c(\C=C\C(=O)N2C[C@H](C[C@H]2C(=O)Nc2ccccc2)N2CCN(CC2)S(=O)(=O)c2ccccc2)c1)-n1cnnn1
: