Target
Coagulation factor XI
Ligand
BDBM238265
Substrate
Meas. Tech.
In Vitro Assay
IC50
5.4±n/a nM
Citation
 Imagawa, AKondo, TNishiyama, TCourtney, SYarnold, CIchihara, OFlanagan, S Substituted pyrrolidines as factor xia inhibitors for the treatment thromboembolic diseases US Patent  US9394250 Publication Date 7/19/2016 
Target
Name:
Coagulation factor XI
Synonyms:
Coagulation factor XIa Coagulation factor XIa light chain FA11_HUMAN Factor XIa PTA | Plasma thromboplastin antecedent
Type:
Enzyme
Mol. Mass.:
70130.58
Organism:
Homo sapiens (Human)
Description:
P03951
Residue:
625
  
Inhibitor
Name:
BDBM238265
Synonyms:
US10336741, Example 94 US9394250, 94 | US9585881, Example 94
Type:
Small organic molecule
Emp. Form.:
C31H33Cl2N9O5S
Mol. Mass.:
714.622
SMILES:
COC(=O)Nc1ccc(cc1)-c1[nH]c(nc1Cl)[C@@H]1C[C@@H](CN1C(=O)\C=C\c1cc(Cl)ccc1-n1cnnn1)C1CCN(CC1)S(C)(=O)=O
: