Target
Prostaglandin E2 receptor EP2 subtype
Ligand
BDBM238332
Substrate
Meas. Tech.
cAMP Assay
pH
7.4±n/a
Temperature
298.15±n/a K
EC50
8±n/a nM
Comments
extracted
Citation
 Donde, YNguyen, JH Therapeutic prostaglandin receptor agonists US Patent  US9394273 Publication Date 7/19/2016 
Target
Name:
Prostaglandin E2 receptor EP2 subtype
Synonyms:
PE2R2_HUMAN PTGER2 Prostaglandin E2 receptor Prostanoid EP2 Receptor
Type:
Enzyme
Mol. Mass.:
39775.71
Organism:
Homo sapiens (Human)
Description:
P43116
Residue:
358
  
Inhibitor
Name:
BDBM238332
Synonyms:
US9394273, 21 | US9394273, 22
Type:
Small organic molecule
Emp. Form.:
C24H25FO4
Mol. Mass.:
396.4513
SMILES:
OC(Cc1ccccc1F)\C=C\[C@H]1CCC(=O)[C@@H]1CCc1ccc(cc1)C(O)=O
: