Target
Prostaglandin E2 receptor EP2 subtype
Ligand
BDBM238324
Substrate
Meas. Tech.
Radioligand Binding Assay
Ki
>10000±n/a nM
Citation
 Donde, YNguyen, JH Therapeutic prostaglandin receptor agonists US Patent  US9394273 Publication Date 7/19/2016 
Target
Name:
Prostaglandin E2 receptor EP2 subtype
Synonyms:
PE2R2_HUMAN PTGER2 Prostaglandin E2 receptor Prostanoid EP2 Receptor
Type:
Enzyme
Mol. Mass.:
39775.71
Organism:
Homo sapiens (Human)
Description:
P43116
Residue:
358
  
Inhibitor
Name:
BDBM238324
Synonyms:
US9394273, 13 | US9394273, 14
Type:
Small organic molecule
Emp. Form.:
C26H28O6
Mol. Mass.:
436.4969
SMILES:
OC(Cc1ccc2OCCOc2c1)\C=C\[C@H]1CCC(=O)[C@@H]1CCc1ccc(cc1)C(O)=O
: