Target
Prostaglandin E2 receptor EP4 subtype
Ligand
BDBM238319
Substrate
Meas. Tech.
Radioligand Binding Assay
Ki
1±n/a nM
Citation
 Donde, YNguyen, JH Therapeutic prostaglandin receptor agonists US Patent  US9394273 Publication Date 7/19/2016 
Target
Name:
Prostaglandin E2 receptor EP4 subtype
Synonyms:
PE2R4_HUMAN PGE2 receptor EP4 subtype PTGER4 Prostanoid EP4 receptor
Type:
Enzyme
Mol. Mass.:
53134.53
Organism:
Homo sapiens (Human)
Description:
P35408
Residue:
488
  
Inhibitor
Name:
BDBM238319
Synonyms:
US9394273, 10 US9394273, 9
Type:
Small organic molecule
Emp. Form.:
C24H25BrO4
Mol. Mass.:
457.357
SMILES:
OC(Cc1cccc(Br)c1)\C=C\[C@H]1CCC(=O)[C@@H]1CCc1ccc(cc1)C(O)=O
: