Target
Muscarinic acetylcholine receptor M3
Ligand
BDBM50084425
Substrate
Meas. Tech.
Radioligand Binding Assay
Temperature
310.15±n/a K
Ki
0.1±n/a nM
Comments
extracted
Citation
 Hughes, ADByun, DJacobsen, JR Diamide compounds having muscarinic receptor antagonist and BETA2 adrenergic receptor agonist activity US Patent  US9394275 Publication Date 7/19/2016 
Target
Name:
Muscarinic acetylcholine receptor M3
Synonyms:
ACM3_HUMAN Cholinergic, muscarinic M3 Muscarinic receptor M3 | RecName: Full=Muscarinic acetylcholine receptor M3
Type:
Enzyme
Mol. Mass.:
66151.03
Organism:
Homo sapiens (Human)
Description:
P20309
Residue:
590
  
Inhibitor
Name:
BDBM50084425
Synonyms:
CHEMBL3426704 | US9394275, I-25
Type:
Small organic molecule
Emp. Form.:
C41H45N5O7
Mol. Mass.:
719.8253
SMILES:
COc1cc(ccc1CNC[C@H](O)c1ccc(O)c2[nH]c(=O)ccc12)N(C)C(=O)CCN1CCC(CC1)OC(=O)Nc1ccccc1-c1ccccc1
: