Target
Beta-2 adrenergic receptor
Ligand
BDBM103803
Substrate
Meas. Tech.
cAMP Assay
Temperature
310.15±n/a K
EC50
1±n/a nM
Comments
extracted
Citation
 Hughes, ADByun, DJacobsen, JR Diamide compounds having muscarinic receptor antagonist and BETA2 adrenergic receptor agonist activity US Patent  US9394275 Publication Date 7/19/2016 
Target
Name:
Beta-2 adrenergic receptor
Synonyms:
ADRB2 ADRB2_HUMAN Beta-2 adrenoceptor | Beta-2 adrenoreceptor
Type:
Mol. Mass.:
46461.69
Organism:
Homo sapiens (Human)
Description:
P07550
Residue:
413
  
Inhibitor
Name:
BDBM103803
Synonyms:
US8551978, I-73 US9394275, I-73 US9682957, I-73
Type:
Small organic molecule
Emp. Form.:
C51H55FN6O7
Mol. Mass.:
883.0168
SMILES:
CC(Cc1cc(CNC(=O)Cc2ccc(cc2)N(C)C(=O)CCN2CCC(CC2)OC(=O)Nc2ccccc2-c2ccccc2)ccc1F)NC[C@H](O)c1ccc(O)c2[nH]c(=O)ccc12
: