Target
Tyrosine-protein kinase JAK1
Ligand
BDBM237828
Substrate
Meas. Tech.
Biochemical HTRF Assay
IC50
1±n/a nM
Citation
 Brubaker, JClose, JSiu, TSmith, GFTorres, LEWoo, HCYoung, JRWei, ZShi, F Pyrazole carboxamides as Janus kinase inhibitors US Patent  US9394282 Publication Date 7/19/2016 
Target
Name:
Tyrosine-protein kinase JAK1
Synonyms:
JAK-1 JAK1A JAK1_HUMAN Janus kinase 1 (JAK1) | Janus kinase 1 JAK1
Type:
Protein
Mol. Mass.:
133293.73
Organism:
Homo sapiens (Human)
Description:
P23458
Residue:
1154
  
Inhibitor
Name:
BDBM237828
Synonyms:
US9394282, 6-15
Type:
Small organic molecule
Emp. Form.:
C22H25FN8O
Mol. Mass.:
436.4853
SMILES:
Cc1c(CN2CC[C@@H](C#N)[C@@H](C2)n2cc(C(N)=O)c(Nc3ccc(F)cc3)n2)cnn1C
: