Target
Tyrosine-protein kinase JAK1
Ligand
BDBM237862
Substrate
Meas. Tech.
Biochemical HTRF Assay
IC50
0.5±n/a nM
Citation
 Brubaker, JClose, JSiu, TSmith, GFTorres, LEWoo, HCYoung, JRWei, ZShi, F Pyrazole carboxamides as Janus kinase inhibitors US Patent  US9394282 Publication Date 7/19/2016 
Target
Name:
Tyrosine-protein kinase JAK1
Synonyms:
JAK-1 JAK1A JAK1_HUMAN Janus kinase 1 (JAK1) | Janus kinase 1 JAK1
Type:
Protein
Mol. Mass.:
133293.73
Organism:
Homo sapiens (Human)
Description:
P23458
Residue:
1154
  
Inhibitor
Name:
BDBM237862
Synonyms:
US9394282, 8-7
Type:
Small organic molecule
Emp. Form.:
C16H14F3N5O5S2
Mol. Mass.:
477.438
SMILES:
NC(=O)c1cn(nc1Nc1ccc(cc1)S(=O)(=O)C(F)(F)F)[C@@H]1CS(=O)(=O)C[C@H]1C#N
: