Target
Tyrosine-protein kinase JAK1
Ligand
BDBM237894
Substrate
Meas. Tech.
Biochemical HTRF Assay
IC50
0.8±n/a nM
Citation
 Brubaker, JClose, JSiu, TSmith, GFTorres, LEWoo, HCYoung, JRWei, ZShi, F Pyrazole carboxamides as Janus kinase inhibitors US Patent  US9394282 Publication Date 7/19/2016 
Target
Name:
Tyrosine-protein kinase JAK1
Synonyms:
JAK-1 JAK1A JAK1_HUMAN Janus kinase 1 (JAK1) | Janus kinase 1 JAK1
Type:
Protein
Mol. Mass.:
133293.73
Organism:
Homo sapiens (Human)
Description:
P23458
Residue:
1154
  
Inhibitor
Name:
BDBM237894
Synonyms:
US9394282, 9-29
Type:
Small organic molecule
Emp. Form.:
C15H15FN6O2
Mol. Mass.:
330.317
SMILES:
NC(=O)c1cn(nc1Nc1ccc(F)nc1)[C@H]1COCC[C@@H]1C#N
: