Target
Macrophage colony-stimulating factor 1 receptor
Ligand
BDBM238135
Substrate
Meas. Tech.
Fluorescence Polarization Competition Immunoassay
pH
7.5±n/a
Temperature
298.15±n/a K
IC50
3.2±n/a nM
Comments
extracted
Citation
 Illig, CRBallentine, SKChen, JDesjarlais, RLMeegalla, SKWall, MWilson, KTomczuk, BE Inhibitors of c-fms kinase US Patent  US9394289 Publication Date 7/19/2016 
Target
Name:
Macrophage colony-stimulating factor 1 receptor
Synonyms:
CSF1R_MOUSE Csfmr Macrophage colony-stimulating factor 1 receptor Proto-oncogene c-Fms
Type:
Protein
Mol. Mass.:
109173.45
Organism:
Mus musculus (Mouse)
Description:
P09581
Residue:
977
  
Inhibitor
Name:
BDBM238135
Synonyms:
US9394289, 32
Type:
Small organic molecule
Emp. Form.:
C25H31N5O3
Mol. Mass.:
449.5453
SMILES:
C[C@H]1CC(O)(C[C@@H](C)O1)c1ccc(NC(=O)c2nc(c[nH]2)C#N)c(n1)C1=CCC(C)(C)CC1
: