Target
Cytochrome P450 11B1, mitochondrial
Ligand
BDBM50378948
Substrate
Meas. Tech.
Cellular Inhibition Assay
Temperature
310.15±n/a K
IC50
16±n/a nM
Comments
extracted
Citation
 Hartmann, RHille, UZimmer, CVock, CAHu, Q Selective CYP11B1 inhibitors for the treatment of cortisol dependent diseases US Patent  US9394290 Publication Date 7/19/2016 
Target
Name:
Cytochrome P450 11B1, mitochondrial
Synonyms:
C11B1_HUMAN CYPXIB1 Cytochrome P450 11B1 Cytochrome P450 11B1, mitochondrial | S11BH
Type:
Enzyme
Mol. Mass.:
57591.44
Organism:
Homo sapiens (Human)
Description:
P15538
Residue:
503
  
Inhibitor
Name:
BDBM50378948
Synonyms:
CHEMBL2011431 | US9394290, 36
Type:
Small organic molecule
Emp. Form.:
C13H11N3S
Mol. Mass.:
241.312
SMILES:
C(c1cccnc1-c1cccs1)n1ccnc1
: