Target
Cytochrome P450 11B2, mitochondrial
Ligand
BDBM50378946
Substrate
Meas. Tech.
Cellular Inhibition Assay
Temperature
310.15±n/a K
IC50
968±n/a nM
Comments
extracted
Citation
 Hartmann, RHille, UZimmer, CVock, CAHu, Q Selective CYP11B1 inhibitors for the treatment of cortisol dependent diseases US Patent  US9394290 Publication Date 7/19/2016 
Target
Name:
Cytochrome P450 11B2, mitochondrial
Synonyms:
Aldosterone Synthase (CYP11B2) Aldosterone-synthesizing enzyme CYP11B2 Cytochrome P450 11B2 Cytochrome P450 11B2, mitochondrial P-450C18 | Steroid 18-hydroxylase
Type:
Protein
Mol. Mass.:
57582.15
Organism:
Homo sapiens (Human)
Description:
P19099
Residue:
503
  
Inhibitor
Name:
BDBM50378946
Synonyms:
CHEMBL2011264 | US9394290, 34
Type:
Small organic molecule
Emp. Form.:
C14H11N3OS
Mol. Mass.:
269.322
SMILES:
O=Cc1ccc(s1)-c1ccc(Cn2ccnc2)cn1
: