Target
Cyclin-dependent kinase/G2/mitotic-specific cyclin- 1
Ligand
BDBM6399
Substrate
Biotinylated CDK1 Peptide Substrate
Meas. Tech.
Kinase Inhibition Assay
IC50
3690±n/a nM
Citation
 Kuo, GHProuty, CWang, AEmanuel, SDeangelis, AZhang, YSong, FBeall, LConnolly, PJKarnachi, PChen, XGruninger, RHSechler, JFuentes-Pesquera, AMiddleton, SAJolliffe, LMurray, WV Synthesis and structure-activity relationships of pyrazine-pyridine biheteroaryls as novel, potent, and selective vascular endothelial growth factor receptor-2 inhibitors. J Med Chem 48:4892-909 (2005)  
Target
Name:
Cyclin-dependent kinase/G2/mitotic-specific cyclin- 1
Synonyms:
CDK1/B CDK1/CyclinB Cyclin-Dependent Kinase 1 (CDK1) Cyclin-dependent kinase/G2/mitotic-specific cyclin 1 | cdk1
Type:
Protein Complex
Mol. Mass.:
Description:
CDK1/Cyclin B complexes were purified from insect cells co-infected with baculovirus vectors containing each of the components.
Components:
This complex has 2 components.
Component 1
Name:
Cyclin-dependent kinase 1
Synonyms:
CDC2 CDK1 CDKN1 Cell division protein kinase 1 P34CDC2 | p34 protein kinase
Type:
Enzyme Subunit
Mol. Mass.:
34101.08
Organism:
Homo sapiens (Human)
Description:
P06493
Residue:
297
  
Component 2
Name:
G2/mitotic-specific cyclin-B1
Synonyms:
CCNB CCNB1_HUMAN
Type:
Enzyme Subunit
Mol. Mass.:
48340.95
Organism:
Homo sapiens (Human)
Description:
P14635
Residue:
433
  
Inhibitor
Name:
BDBM6399
Synonyms:
5-[6-(3-Chloro-phenylamino)-pyrazin-2-yl]-N-(2-(dimethylamino)-ethyl)-nicotinamide Pyrazine-Pyridine Biheteroaryl 42
Type:
Small organic molecule
Emp. Form.:
C20H21ClN6O
Mol. Mass.:
396.873
SMILES:
CN(C)CCNC(=O)c1cncc(c1)-c1cncc(Nc2cccc(Cl)c2)n1
:
Substrate
Name:
Biotinylated CDK1 Peptide Substrate
Synonyms:
Type:
Peptide
Mol. Mass.:
3057.82
Organism:
Description:
Residue:
27