Target
Epidermal growth factor receptor
Ligand
BDBM6416
Substrate
EGFR Substrate
Meas. Tech.
Kinase Inhibition Assay
IC50
1360±n/a nM
Citation
 Kuo, GHProuty, CWang, AEmanuel, SDeangelis, AZhang, YSong, FBeall, LConnolly, PJKarnachi, PChen, XGruninger, RHSechler, JFuentes-Pesquera, AMiddleton, SAJolliffe, LMurray, WV Synthesis and structure-activity relationships of pyrazine-pyridine biheteroaryls as novel, potent, and selective vascular endothelial growth factor receptor-2 inhibitors. J Med Chem 48:4892-909 (2005)  
Target
Name:
Epidermal growth factor receptor
Synonyms:
EGF Receptor Substrate EGFR_HUMAN ERBB1 Epidermal Growth Factor Receptor erbB-1 Epidermal growth factor receptor (EGFR) HER1 Proto-oncogene c-ErbB-1 Tyrosine-Protein Kinase ErbB-1
Type:
Receptor Kinase Domain
Mol. Mass.:
134279.59
Organism:
Homo sapiens (Human)
Description:
P00533
Residue:
1210
  
Inhibitor
Name:
BDBM6416
Synonyms:
3-[(5-{6-[(3-chlorophenyl)amino]pyrazin-2-yl}pyridin-3-yl)amino]propan-1-ol Pyrazine-Pyridine Biheteroaryl 7 | Pyrazine-Pyridine deriv. 15
Type:
Small organic molecule
Emp. Form.:
C18H18ClN5O
Mol. Mass.:
355.821
SMILES:
OCCCNc1cncc(c1)-c1cncc(Nc2cccc(Cl)c2)n1
:
Substrate
Name:
EGFR Substrate
Synonyms:
Type:
Peptide
Mol. Mass.:
2045.82
Organism:
Description:
Residue:
17
ITINDRVYIHPFAMIDE