Target
Bcl-2-like protein 1
Ligand
BDBM238185
Substrate
Meas. Tech.
Fluorescence Polarization-Based Binding Assay
pH
7.4±n/a
Temperature
298.15±n/a K
Ki
>5000±n/a nM
Comments
extracted
Citation
 Nikolovska-Coleska, ZAbulwerdi, FShowalter, HMiao, LStuckey, JMady, A Small molecule inhibitors of MCL-1 and uses thereof US Patent  US9394303 Publication Date 7/19/2016 
Target
Name:
Bcl-2-like protein 1
Synonyms:
Apoptosis regulator Bcl-XL Bcl2l Bclx
Type:
Protein
Mol. Mass.:
26122.63
Organism:
Mus musculus (Mouse)
Description:
Q64373
Residue:
233
  
Inhibitor
Name:
BDBM238185
Synonyms:
US9394303, 57
Type:
Small organic molecule
Emp. Form.:
C27H22ClN3O4
Mol. Mass.:
487.934
SMILES:
Cc1nn(Cc2ccc(Oc3cc(C)c(Cl)c(C)c3)cc2)c2nc(cc(C(O)=O)c12)-c1ccco1
: