Target
Lysosomal acid glucosylceramidase
Ligand
BDBM238204
Substrate
Meas. Tech.
Enzyme Assay
pH
4.5±n/a
Ki
5260±890 nM
IC50
12700±2140 nM
Comments
extracted
Citation
 Wustman, BA Method for the treatment of neurological disorders by enhancing the activity of β-glucocerebrosidase US Patent  US9402837 Publication Date 8/2/2016 
Target
Name:
Lysosomal acid glucosylceramidase
Synonyms:
Acid beta-glucosidase Beta-glucocerebrosidase D-glucosyl-N-acylsphingosine glucohydrolase GBA1 GC GLUC Glucosylceramidase (GBA) Glucosylceramidase precursor (Beta-glucocerebrosidase) (Acid beta-glucosidase) (D-glucosyl-N-acylsphingosine glucohydrolase) (Alglucerase) (Imiglucerase) beta-glucocerebrosidase (GCase)
Type:
Enzyme
Mol. Mass.:
59724.64
Organism:
Homo sapiens (Human)
Description:
The beta-Glu activity was measured with commercially available beta-glucocerebrosidase (Ceredase) as the enzyme source.
Residue:
536
  
Inhibitor
Name:
BDBM238204
Synonyms:
US9402837, 8
Type:
Small organic molecule
Emp. Form.:
C14H21NO3
Mol. Mass.:
251.3214
SMILES:
Cc1cccc(CN2C[C@@H](O)[C@H](O)[C@@H](CO)C2)c1
: