Target
Carbonic anhydrase 1
Ligand
BDBM238298
Substrate
Meas. Tech.
CA Activity Assay
pH
7.4±0
Temperature
298.15±0 K
Ki
108±n/a nM
Citation
 Sen, EAlim, ZDuran, HIsgör, MMBeydemir, Å¿Kasimogullari, ROk, S Inhibitory effect of novel pyrazole carboxamide derivatives on human carbonic anhydrase enzyme. J Enzyme Inhib Med Chem 28:328-36 (2013)  
Target
Name:
Carbonic anhydrase 1
Synonyms:
CA-I CAB Carbonate dehydratase I Carbonic anhydrase 1 (CA I) Carbonic anhydrase 1 (Recombinant CA I) Carbonic anhydrase B Carbonic anhydrase I (CA I) Carbonic anhydrase I (CAI) Carbonic anhydrase isoenzyme I (hCA I) | hCA
Type:
Enzyme
Mol. Mass.:
28873.37
Organism:
Homo sapiens (Human)
Description:
P00915
Residue:
261
  
Inhibitor
Name:
BDBM238298
Synonyms:
1-(3-aminophenyl)-4-benzoyl-5-phenyl-N-(4-sulfamoylphenyl)-1H-pyrazole-3-carboxamide (3)
Type:
Small organic molecule
Emp. Form.:
C29H23N5O4S
Mol. Mass.:
537.589
SMILES:
Nc1cccc(c1)-n1nc(C(=O)Nc2ccc(cc2)S(N)(=O)=O)c(C(=O)c2ccccc2)c1-c1ccccc1
: