Target
Lysine-specific demethylase 4C
Ligand
BDBM293661
Substrate
Meas. Tech.
JMJD2C Assay
Temperature
298.15±n/a K
IC50
550±n/a nM
Comments
extracted
Citation
 Boloor, AChen, YKWallace, MB Histone demethylase inhibitors US Patent  US10106534 Publication Date 10/23/2018 
Target
Name:
Lysine-specific demethylase 4C
Synonyms:
GASC-1 protein Gene amplified in squamous cell carcinoma 1 protein JMJD2C Jumonji domain-containing protein 2C KDM4C_HUMAN | KIAA0780
Type:
Protein
Mol. Mass.:
119979.01
Organism:
Homo sapiens (Human)
Description:
Q9H3R0
Residue:
1056
  
Inhibitor
Name:
BDBM293661
Synonyms:
3-({[6-(2-oxopyrrolidin-1-yl)-1,2,3,4-tetrahydronaphthalen-1- | US10106534, Example 3
Type:
Small organic molecule
Emp. Form.:
C21H23N3O3
Mol. Mass.:
365.4256
SMILES:
OC(=O)c1ccncc1NCC1CCCc2cc(ccc12)N1CCCC1=O
: