Target
Platelet-derived growth factor receptor beta
Ligand
BDBM238842
Substrate
Meas. Tech.
Kinase Assay
pH
7.4±n/a
Temperature
303.15±n/a K
IC50
61±n/a nM
Comments
extracted
Citation
 Boral, SMalone, TCWang, S Indole-3-carboxamides as kinase inhibitors US Patent  US9403803 Publication Date 8/2/2016 
Target
Name:
Platelet-derived growth factor receptor beta
Synonyms:
Beta-type platelet-derived growth factor receptor CD140b antigen PDGF Receptor Substrate PDGFR PDGFR-1 PDGFRB PGFRB_HUMAN Platelet-derived growth factor receptor 1 Platelet-derived growth factor receptor beta (PDGFR-beta) Platelet-derived growth factor receptor beta (PDGFRbeta) | VHL/PDGFRB
Type:
Enzyme
Mol. Mass.:
123922.25
Organism:
Homo sapiens (Human)
Description:
P09619
Residue:
1106
  
Inhibitor
Name:
BDBM238842
Synonyms:
US9403803, 2
Type:
Small organic molecule
Emp. Form.:
C23H17F3N4O2
Mol. Mass.:
438.4019
SMILES:
NC(=O)c1c([nH]c2ccccc12)-c1ccc(NC(=O)Nc2cccc(c2)C(F)(F)F)cc1
: