Target
Hepatocyte growth factor receptor
Ligand
BDBM238936
Substrate
Meas. Tech.
Lanthanide Fluoro-Immunoassay
Temperature
298.15±n/a K
IC50
5±n/a nM
Comments
extracted
Citation
 Jung, HJHa, JDCho, SYKim, HRLee, KHLee, COChoi, SUPark, CH Triazolopyrazine derivative and use thereof US Patent  US9403831 Publication Date 8/2/2016 
Target
Name:
Hepatocyte growth factor receptor
Synonyms:
Hepatocyte growth factor receptor Hepatocyte growth factor receptor (c-MET) MET Met proto-oncogene (hepatocyte growth factor receptor) Tyrosine-protein kinase Met (c-Met) c-Met kinase
Type:
Protein
Mol. Mass.:
155559.73
Organism:
Homo sapiens (Human)
Description:
P08581
Residue:
1390
  
Inhibitor
Name:
BDBM238936
Synonyms:
US9403831, 21
Type:
Small organic molecule
Emp. Form.:
C24H31N11O2
Mol. Mass.:
505.5754
SMILES:
Cn1cc(cn1)-c1cnc2nnn(C[C@@H]3CN(CCO3)c3ncc(cn3)C3CCN(CCO)CC3)c2n1
: