Target
E3 ubiquitin-protein ligase SMURF1 [420-757]
Ligand
BDBM238969
Substrate
Meas. Tech.
Biochemical Assay
Temperature
298.15±n/a K
IC50
1200±n/a nM
Comments
extracted
Citation
 Edwards, AAhmed, MPulz, RARooney, LASmith, NTroxler, TJ Carboxamide derivatives US Patent  US9403833 Publication Date 8/2/2016 
Target
Name:
E3 ubiquitin-protein ligase SMURF1 [420-757]
Synonyms:
HECT-type E3 ubiquitin transferase SMURF1 SMUF1_HUMAN | SMURF1
Type:
Enzyme
Mol. Mass.:
39188.96
Organism:
Homo sapiens (Human)
Description:
HECTdomain amino acid 420-757
Residue:
338
  
Inhibitor
Name:
BDBM238969
Synonyms:
US9403833, 4
Type:
Small organic molecule
Emp. Form.:
C23H30N6O3
Mol. Mass.:
438.5227
SMILES:
COc1ccc(cc1C)-n1nnc(C(=O)Nc2c(C)n(C)n(C3CCCCC3)c2=O)c1C
: