Target
Beta-secretase 1
Ligand
BDBM238994
Substrate
Meas. Tech.
Cell-Free Assay
pH
4.5±n/a
IC50
>86000000±n/a nM
Comments
extracted
Citation
 Brodney, MAO'Neill, BTButler, CRLaChapelle, EA Carbocyclic- and heterocyclic-substituted hexahydropyrano[3,4-d][1,3]thiazin-2-amine compounds US Patent  US9403846 Publication Date 8/2/2016 
Target
Name:
Beta-secretase 1
Synonyms:
ASP2 Aspartyl protease 2 BACE1 Beta-secretase (BACE) Beta-secretase 1 (BACE 1) Beta-secretase 1 (BACE1) Beta-site amyloid precursor protein cleaving enzyme 1 Memapsin-2 beta-Secretase (BACE-1) | beta-Secretase (BACE1)
Type:
Protein
Mol. Mass.:
55755.10
Organism:
Homo sapiens (Human)
Description:
P56817
Residue:
501
  
Inhibitor
Name:
BDBM238994
Synonyms:
US9403846, C74
Type:
Small organic molecule
Emp. Form.:
C17H20F2N2OS
Mol. Mass.:
338.415
SMILES:
NC1=N[C@@]2(CO[C@H](CC3CC3)C[C@@H]2CS1)c1ccc(F)cc1F
: