Target
Receptor-type tyrosine-protein kinase FLT3 [564-993]
Ligand
BDBM239008
Substrate
BioDB n*24 SEQ ID NO: 1
Meas. Tech.
Biochemical Assay
pH
7.9±n/a
Temperature
301.15±n/a K
IC50
1171±n/a nM
Comments
extracted
Citation
 Lombardi Borgia, ACiomei, MDonati, DNesi, M Substituted indazole derivatives active as kinase inhibitors US Patent  US9408850 Publication Date 8/9/2016 
Target
Name:
Receptor-type tyrosine-protein kinase FLT3 [564-993]
Synonyms:
CD135 FLT3 Receptor-type tyrosine-protein kinase FLT3 | STK1
Type:
Protein
Mol. Mass.:
49684.10
Organism:
Homo sapiens (Human)
Description:
aa 564-993
Residue:
430
  
Inhibitor
Name:
BDBM239008
Synonyms:
US10028934, Compound 5 US9408850, 5 | US9597317, 5
Type:
Small organic molecule
Emp. Form.:
C32H31N5O3
Mol. Mass.:
533.6202
SMILES:
CN1CCN(CC1)c1ccc(cc1)C(=O)Nc1n[nH]c2cc(OCc3cccc(Oc4ccccc4)c3)ccc12
:
Substrate
Name:
BioDB n*24 SEQ ID NO: 1
Synonyms:
Type:
Peptide Substrate
Mol. Mass.:
2821.27
Organism:
Artificial Organism
Description:
SEQ ID NO: 1
Residue:
25